Reaction Details
TargetMast/stem cell growth factor receptor Kit
LigandBDBM50207500
Substrate/Competitorn/a
Meas. Tech.ChEMBL_622359 (CHEMBL1114167)
IC50 69±n/a nM
Citation Kansal, NSilakari, ORavikumar, M Three dimensional pharmacophore modelling for c-Kit receptor tyrosine kinase inhibitors. Eur J Med Chem45:393-404 (2010) 
 
Mast/stem cell growth factor receptor Kit
Name:Mast/stem cell growth factor receptor Kit
Type:Protein
Mol. Mass.:109869.37
Organism:Homo sapiens (Human)
Description:P10721
Residue:976
BDBM50207500
NameBDBM50207500
Synonyms:1-(4-(3-amino-1H-indazol-4-yl)phenyl)-3-(3-bromophenyl)urea N-[4-(3-amino-1H-indazol-4-yl)phenyl]-N'-(3-bromophenyl)-urea
TypeSmall organic molecule
Emp. Form.C20H16BrN5O
Mol. Mass.422.278
SMILESNc1n[nH]c2cccc(-c3ccc(NC(=O)Nc4cccc(Br)c4)cc3)c12