Reaction Details
TargetAldo-keto reductase family 1 member A1
LigandBDBM50213307
Substrate/Competitorn/a
Meas. Tech.ChEMBL_615076 (CHEMBL1105192)
IC50 5400±n/a nM
Citation Carbone, VGiglio, MChung, RHuyton, TAdams, JMaccari, ROttana, RHara, AEl-Kabbani, O Structure of aldehyde reductase in ternary complex with a 5-arylidene-2,4-thiazolidinedione aldose reductase inhibitor. Eur J Med Chem45:1140-5 (2010) 
 
Aldo-keto reductase family 1 member A1
Name:Aldo-keto reductase family 1 member A1
Type:PROTEIN
Mol. Mass.:36557.09
Organism:Sus scrofa
Description:ChEMBL_615076
Residue:325
BDBM50213307
NameBDBM50213307
Synonyms:CHEMBL396176 [5-(3-carboxymethoxy-4-methoxybenzylidene)-2,4-dioxothiazolidin-3-yl]acetic acid
TypeSmall organic molecule
Emp. Form.C15H13NO8S
Mol. Mass.367.331
SMILESCOc1ccc(\C=C2/SC(=O)N(CC(O)=O)C2=O)cc1OCC(O)=O