Reaction Details
TargetHistone deacetylase 3
LigandBDBM50312620
Substrate/Competitorn/a
Meas. Tech.ChEMBL_616014 (CHEMBL1101058)
IC50 1.55±n/a nM
Citation He, RChen, YChen, YOugolkov, AVZhang, JSSavoy, DNBilladeau, DDKozikowski, AP Synthesis and biological evaluation of triazol-4-ylphenyl-bearing histone deacetylase inhibitors as anticancer agents. J Med Chem53:1347-56 (2010) 
 
Histone deacetylase 3
Name:Histone deacetylase 3
Type:Enzyme
Mol. Mass.:48829.55
Organism:Homo sapiens (Human)
Description:O15379
Residue:428
BDBM50312620
NameBDBM50312620
Synonyms:CHEMBL1094708 | Octanedioic Acid-{3-[1-(3-Aminophenyl)-1H-[1,2,3]triazol-4-yl]phenyl}amide-Hydroxyamide
TypeSmall organic molecule
Emp. Form.C22H26N6O3
Mol. Mass.422.4802
SMILESNc1ccc(cc1)-n1cc(nn1)-c1cccc(NC(=O)CCCCCCC(=O)NO)c1