Reaction Details
TargetHistone deacetylase 3
LigandBDBM50312622
Substrate/Competitorn/a
Meas. Tech.ChEMBL_616014 (CHEMBL1101058)
IC50 1.66±n/a nM
Citation He, RChen, YChen, YOugolkov, AVZhang, JSSavoy, DNBilladeau, DDKozikowski, AP Synthesis and biological evaluation of triazol-4-ylphenyl-bearing histone deacetylase inhibitors as anticancer agents. J Med Chem53:1347-56 (2010) 
 
Histone deacetylase 3
Name:Histone deacetylase 3
Type:Enzyme
Mol. Mass.:48829.55
Organism:Homo sapiens (Human)
Description:O15379
Residue:428
BDBM50312622
NameBDBM50312622
Synonyms:CHEMBL1088735 | Octanedioic Acid Hydroxyamide-{3-[1-(4-Hydroxymethylphenyl)-1H-[1,2,3]triazol-4-yl]phenyl}amide
TypeSmall organic molecule
Emp. Form.C23H27N5O4
Mol. Mass.437.4916
SMILESONC(=O)CCCCCCC(=O)Nc1cccc(c1)-c1cn(Cc2ccc(O)cc2)nn1