Reaction Details
TargetHistone deacetylase 1
LigandBDBM50312625
Substrate/Competitorn/a
Meas. Tech.ChEMBL_616012 (CHEMBL1101056)
IC50>30000±n/a nM
Citation He, RChen, YChen, YOugolkov, AVZhang, JSSavoy, DNBilladeau, DDKozikowski, AP Synthesis and biological evaluation of triazol-4-ylphenyl-bearing histone deacetylase inhibitors as anticancer agents. J Med Chem53:1347-56 (2010) 
 
Histone deacetylase 1
Name:Histone deacetylase 1
Type:Enzyme
Mol. Mass.:55090.27
Organism:Homo sapiens (Human)
Description:Q13547
Residue:482
BDBM50312625
NameBDBM50312625
Synonyms:CHEMBL1087053 | N1-(2-aminophenyl)-N8-(3-(4-phenyl-1H-1,2,3-triazol-1-yl)phenyl)octanediamide
TypeSmall organic molecule
Emp. Form.C28H30N6O2
Mol. Mass.482.5768
SMILESNc1ccccc1NC(=O)CCCCCCC(=O)Nc1cccc(c1)-n1cc(nn1)-c1ccccc1