Reaction Details
TargetHistone deacetylase 3
LigandBDBM50312627
Substrate/Competitorn/a
Meas. Tech.ChEMBL_616014 (CHEMBL1101058)
IC50 3.7±n/a nM
Citation He, RChen, YChen, YOugolkov, AVZhang, JSSavoy, DNBilladeau, DDKozikowski, AP Synthesis and biological evaluation of triazol-4-ylphenyl-bearing histone deacetylase inhibitors as anticancer agents. J Med Chem53:1347-56 (2010) 
 
Histone deacetylase 3
Name:Histone deacetylase 3
Type:Enzyme
Mol. Mass.:48829.55
Organism:Homo sapiens (Human)
Description:O15379
Residue:428
BDBM50312627
NameBDBM50312627
Synonyms:CHEMBL1094707 | Octanedioic Acid-[3-(1-Cyclohexyl-1H-[1,2,3]triazol-4-yl)phenyl]amide Hydroxyamide
TypeSmall organic molecule
Emp. Form.C22H31N5O3
Mol. Mass.413.5132
SMILESONC(=O)CCCCCCC(=O)Nc1cccc(c1)-c1cn(nn1)C1CCCCC1