Reaction Details
TargetHistone deacetylase 1
LigandBDBM50312626
Substrate/Competitorn/a
Meas. Tech.ChEMBL_616012 (CHEMBL1101056)
IC50 8.7±n/a nM
Citation He, RChen, YChen, YOugolkov, AVZhang, JSSavoy, DNBilladeau, DDKozikowski, AP Synthesis and biological evaluation of triazol-4-ylphenyl-bearing histone deacetylase inhibitors as anticancer agents. J Med Chem53:1347-56 (2010) 
 
Histone deacetylase 1
Name:Histone deacetylase 1
Type:Enzyme
Mol. Mass.:55090.27
Organism:Homo sapiens (Human)
Description:Q13547
Residue:482
BDBM50312626
NameBDBM50312626
Synonyms:CHEMBL1088734 | Octanedioic Acid Hydroxyamide-{3-[1-(4-Trifluoromethylphenyl)-1H-[1,2,3]triazol-4-yl]phenyl}amide
TypeSmall organic molecule
Emp. Form.C23H24F3N5O3
Mol. Mass.475.4636
SMILESONC(=O)CCCCCCC(=O)Nc1cccc(c1)-c1cn(nn1)-c1ccc(cc1)C(F)(F)F