Reaction Details
TargetHistone deacetylase 3
LigandBDBM24351
Substrate/Competitorn/a
Meas. Tech.ChEMBL_616014 (CHEMBL1101058)
IC50 7.2±n/a nM
Citation He, RChen, YChen, YOugolkov, AVZhang, JSSavoy, DNBilladeau, DDKozikowski, AP Synthesis and biological evaluation of triazol-4-ylphenyl-bearing histone deacetylase inhibitors as anticancer agents. J Med Chem53:1347-56 (2010) 
 
Histone deacetylase 3
Name:Histone deacetylase 3
Type:Enzyme
Mol. Mass.:48829.55
Organism:Homo sapiens (Human)
Description:O15379
Residue:428
BDBM24351
NameBDBM24351
Synonyms:N-hydroxy-N'-[3-(1-phenyl-1H-1,2,3-triazol-4-yl)phenyl]octanediamide | Triazole Ligand, 10c
TypeSmall organic molecule
Emp. Form.C22H25N5O3
Mol. Mass.407.4656
SMILESONC(=O)CCCCCCC(=O)Nc1cccc(c1)-c1cn(nn1)-c1ccccc1