Reaction Details
TargetHistone deacetylase 2
LigandBDBM50312630
Substrate/Competitorn/a
Meas. Tech.ChEMBL_616013 (CHEMBL1101057)
IC50 48.2±n/a nM
Citation He, RChen, YChen, YOugolkov, AVZhang, JSSavoy, DNBilladeau, DDKozikowski, AP Synthesis and biological evaluation of triazol-4-ylphenyl-bearing histone deacetylase inhibitors as anticancer agents. J Med Chem53:1347-56 (2010) 
 
Histone deacetylase 2
Name:Histone deacetylase 2
Type:Chromatin regulator; hydrolase; repressor
Mol. Mass.:55356.54
Organism:Homo sapiens (Human)
Description:Q92769
Residue:488
BDBM50312630
NameBDBM50312630
Synonyms:CHEMBL1094710 | Octanedioic Acid-[3-(4-Cyclohexyl-[1,2,3]triazol-1-yl)phenyl]-amide-Hydroxyamide
TypeSmall organic molecule
Emp. Form.C22H31N5O3
Mol. Mass.413.5132
SMILESONC(=O)CCCCCCC(=O)Nc1cccc(c1)-n1cc(nn1)C1CCCCC1