Reaction Details
TargetSialidase-2
LigandBDBM26656
Substrate/Competitorn/a
Meas. Tech.ChEMBL_617801 (CHEMBL1100507)
IC50 130000±n/a nM
Citation Arioka, SSakagami, MUematsu, RYamaguchi, HTogame, HTakemoto, HHinou, HNishimura, S Potent inhibitor scaffold against Trypanosoma cruzi trans-sialidase. Bioorg Med Chem18:1633-40 (2010) 
 
Sialidase-2
Name:Sialidase-2
Type:PROTEIN
Mol. Mass.:42256.20
Organism:Homo sapiens (Human)
Description:ChEMBL_960638
Residue:380
BDBM26656
NameBDBM26656
Synonyms:5,7,3,4,5-pentahydroxyflavone | 5,7-dihydroxy-2-(3,4,5-trihydroxyphenyl)-4H-chromen-4-one
TypeFlavonoid
Emp. Form.C15H10O7
Mol. Mass.302.2357
SMILESOc1cc(O)c2c(c1)oc(cc2=O)-c1cc(O)c(O)c(O)c1