Reaction Details
TargetProthrombin
LigandBDBM50312654
Substrate/Competitorn/a
Meas. Tech.ChEMBL_617811 (CHEMBL1100517)
Ki 13±n/a nM
Citation Lu, TMarkotan, TBallentine, SKGiardino, ECSpurlino, JCrysler, CSBrown, KMaryanoff, BETomczuk, BEDamiano, BPShukla, UEnd, DAndrade-Gordon, PBone, RFPlayer, MR Discovery and clinical evaluation of 1-{N-[2-(amidinoaminooxy)ethyl]amino}carbonylmethyl-6-methyl-3-[2,2-difluoro-2-phenylethylamino]pyrazinone (RWJ-671818), a thrombin inhibitor with an oxyguanidine P1 motif. J Med Chem53:1843-56 (2010) 
 
Prothrombin
Name:Prothrombin
Type:Protein
Mol. Mass.:70029.57
Organism:Homo sapiens (Human)
Description:P00734
Residue:622
BDBM50312654
NameBDBM50312654
Synonyms:1-{N-[2-(Amidinoaminooxy)ethyl]amino}carbonylmethyl-6-methyl-3-(4-fluorophenethylamino)pyrazinone | CHEMBL1083500
TypeSmall organic molecule
Emp. Form.C18H24FN7O3
Mol. Mass.405.4267
SMILES[#6]-c1cnc(-[#7]-[#6]-[#6]-c2ccc(F)cc2)c(=O)n1-[#6]-[#6](=O)-[#7]-[#6]-[#6]-[#8]\[#7]=[#6](\[#7])-[#7]