Reaction Details
TargetCholesteryl ester transfer protein
LigandBDBM50312730
Substrate/Competitorn/a
Meas. Tech.ChEMBL_615620 (CHEMBL1104194)
IC50 33±n/a nM
Citation Schmeck, CGielen-Haertwig, HVakalopoulos, ABischoff, HLi, VWirtz, GWeber, O Novel tetrahydrochinoline derived CETP inhibitors. Bioorg Med Chem Lett20:1740-3 (2010) 
 
Cholesteryl ester transfer protein
Name:Cholesteryl ester transfer protein
Type:Enzyme
Mol. Mass.:54751.53
Organism:Homo sapiens (Human)
Description:P11597
Residue:493
BDBM50312730
NameBDBM50312730
Synonyms:(S)-(4'-cyclohexyl-5'-hydroxy-2'-isopropyl-6',8'-dihydro-5'H-spiro[cyclobutane-1,7'-quinoline]-3'-yl)(4-(trifluoromethyl)phenyl)methanone | CHEMBL1086637
TypeSmall organic molecule
Emp. Form.C29H34F3NO2
Mol. Mass.485.581
SMILESCC(C)c1nc2CC3(CCC3)C[C@H](O)c2c(C2CCCCC2)c1C(=O)c1ccc(cc1)C(F)(F)F