Reaction Details
TargetCholesteryl ester transfer protein
LigandBDBM50312731
Substrate/Competitorn/a
Meas. Tech.ChEMBL_615620 (CHEMBL1104194)
IC50 60±n/a nM
Citation Schmeck, CGielen-Haertwig, HVakalopoulos, ABischoff, HLi, VWirtz, GWeber, O Novel tetrahydrochinoline derived CETP inhibitors. Bioorg Med Chem Lett20:1740-3 (2010) 
 
Cholesteryl ester transfer protein
Name:Cholesteryl ester transfer protein
Type:Enzyme
Mol. Mass.:54751.53
Organism:Homo sapiens (Human)
Description:P11597
Residue:493
BDBM50312731
NameBDBM50312731
Synonyms:(S)-(4-cyclohexyl-2-cyclopentyl-5-hydroxy-7,7-dimethyl-5,6,7,8-tetrahydroquinolin-3-yl)(4-(trifluoromethyl)phenyl)methanone | CHEMBL1080866
TypeSmall organic molecule
Emp. Form.C30H36F3NO2
Mol. Mass.499.6075
SMILESCC1(C)C[C@H](O)c2c(C1)nc(C1CCCC1)c(C(=O)c1ccc(cc1)C(F)(F)F)c2C1CCCCC1