Reaction Details
TargetCholesteryl ester transfer protein
LigandBDBM50312732
Substrate/Competitorn/a
Meas. Tech.ChEMBL_615620 (CHEMBL1104194)
IC50 55±n/a nM
Citation Schmeck, CGielen-Haertwig, HVakalopoulos, ABischoff, HLi, VWirtz, GWeber, O Novel tetrahydrochinoline derived CETP inhibitors. Bioorg Med Chem Lett20:1740-3 (2010) 
 
Cholesteryl ester transfer protein
Name:Cholesteryl ester transfer protein
Type:Enzyme
Mol. Mass.:54751.53
Organism:Homo sapiens (Human)
Description:P11597
Residue:493
BDBM50312732
NameBDBM50312732
Synonyms:(S)-(4'-cyclohexyl-2'-cyclopentyl-5'-hydroxy-6',8'-dihydro-5'H-spiro[cyclobutane-1,7'-quinoline]-3'-yl)(4-(trifluoromethyl)phenyl)methanone | CHEMBL1080543
TypeSmall organic molecule
Emp. Form.C31H36F3NO2
Mol. Mass.511.6182
SMILESO[C@H]1CC2(CCC2)Cc2nc(C3CCCC3)c(C(=O)c3ccc(cc3)C(F)(F)F)c(C3CCCCC3)c12