Reaction Details
TargetSodium-dependent noradrenaline transporter
LigandBDBM50312769
Substrate/Competitorn/a
Meas. Tech.ChEMBL_615847 (CHEMBL1101957)
Ki>10000±n/a nM
Citation Yu, MLizarzaburu, MBeckmann, HConnors, RDai, KHaller, KLi, CLiang, LLindstrom, MMa, JMotani, AWanska, MZhang, ALi, LMedina, JC Identification of piperazine-bisamide GHSR antagonists for the treatment of obesity. Bioorg Med Chem Lett20:1758-62 (2010) 
 
Sodium-dependent noradrenaline transporter
Name:Sodium-dependent noradrenaline transporter
Type:Multi-pass membrane protein
Mol. Mass.:69337.72
Organism:Homo sapiens (Human)
Description:P23975
Residue:617
BDBM50312769
NameBDBM50312769
Synonyms:(S)-(4-(1H-indole-6-carbonyl)-3-methylpiperazin-1-yl)(4'-fluorobiphenyl-4-yl)methanone | CHEMBL1080926
TypeSmall organic molecule
Emp. Form.C27H24FN3O2
Mol. Mass.441.4968
SMILESC[C@H]1CN(CCN1C(=O)c1ccc2cc[nH]c2c1)C(=O)c1ccc(cc1)-c1ccc(F)cc1