Reaction Details
TargetHistamine H2 receptor
LigandBDBM50312776
Substrate/Competitorn/a
Meas. Tech.ChEMBL_615848 (CHEMBL1101958)
Ki>10000±n/a nM
Citation Yu, MLizarzaburu, MBeckmann, HConnors, RDai, KHaller, KLi, CLiang, LLindstrom, MMa, JMotani, AWanska, MZhang, ALi, LMedina, JC Identification of piperazine-bisamide GHSR antagonists for the treatment of obesity. Bioorg Med Chem Lett20:1758-62 (2010) 
 
Histamine H2 receptor
Name:Histamine H2 receptor
Type:G Protein-Coupled Receptor (GPCR)
Mol. Mass.:40115.31
Organism:Homo sapiens (Human)
Description:n/a
Residue:359
BDBM50312776
NameBDBM50312776
Synonyms:(S)-(4-(1H-indole-6-carbonyl)-3-methylpiperazin-1-yl)(biphenyl-4-yl)methanone | CHEMBL1082211
TypeSmall organic molecule
Emp. Form.C27H25N3O2
Mol. Mass.423.5063
SMILESC[C@H]1CN(CCN1C(=O)c1ccc2cc[nH]c2c1)C(=O)c1ccc(cc1)-c1ccccc1