Reaction Details
Target5-hydroxytryptamine receptor 2C
LigandBDBM50312768
Substrate/Competitorn/a
Meas. Tech.ChEMBL_615838 (CHEMBL1101948)
Ki>10000±n/a nM
Citation Yu, MLizarzaburu, MBeckmann, HConnors, RDai, KHaller, KLi, CLiang, LLindstrom, MMa, JMotani, AWanska, MZhang, ALi, LMedina, JC Identification of piperazine-bisamide GHSR antagonists for the treatment of obesity. Bioorg Med Chem Lett20:1758-62 (2010) 
 
5-hydroxytryptamine receptor 2C
Name:5-hydroxytryptamine receptor 2C
Type:G Protein-Coupled Receptor (GPCR)
Mol. Mass.:51836.79
Organism:Homo sapiens (Human)
Description:P28335
Residue:458
BDBM50312768
NameBDBM50312768
Synonyms:(S)-(4-(1H-indole-6-carbonyl)-3-methylpiperazin-1-yl)(4'-(trifluoromethoxy)biphenyl-4-yl)methanone | CHEMBL1080755
TypeSmall organic molecule
Emp. Form.C28H24F3N3O3
Mol. Mass.507.5037
SMILESC[C@H]1CN(CCN1C(=O)c1ccc2cc[nH]c2c1)C(=O)c1ccc(cc1)-c1ccc(OC(F)(F)F)cc1