Reaction Details
TargetD(2) dopamine receptor
LigandBDBM50312772
Substrate/Competitorn/a
Meas. Tech.ChEMBL_615841 (CHEMBL1101951)
Ki>10000±n/a nM
Citation Yu, MLizarzaburu, MBeckmann, HConnors, RDai, KHaller, KLi, CLiang, LLindstrom, MMa, JMotani, AWanska, MZhang, ALi, LMedina, JC Identification of piperazine-bisamide GHSR antagonists for the treatment of obesity. Bioorg Med Chem Lett20:1758-62 (2010) 
 
D(2) dopamine receptor
Name:D(2) dopamine receptor
Type:Cell-surface receptors
Mol. Mass.:50647.10
Organism:Homo sapiens (Human)
Description:P14416
Residue:443
BDBM50312772
NameBDBM50312772
Synonyms:(R)-(4-(1H-indole-6-carbonyl)-3-methylpiperazin-1-yl)(3'-methoxybiphenyl-4-yl)methanone | CHEMBL1081649
TypeSmall organic molecule
Emp. Form.C28H27N3O3
Mol. Mass.453.5323
SMILESCOc1cccc(c1)-c1ccc(cc1)C(=O)N1CCN([C@H](C)C1)C(=O)c1ccc2cc[nH]c2c1