Reaction Details
TargetD(2) dopamine receptor
LigandBDBM50312773
Substrate/Competitorn/a
Meas. Tech.ChEMBL_615841 (CHEMBL1101951)
Ki>10000±n/a nM
Citation Yu, MLizarzaburu, MBeckmann, HConnors, RDai, KHaller, KLi, CLiang, LLindstrom, MMa, JMotani, AWanska, MZhang, ALi, LMedina, JC Identification of piperazine-bisamide GHSR antagonists for the treatment of obesity. Bioorg Med Chem Lett20:1758-62 (2010) 
 
D(2) dopamine receptor
Name:D(2) dopamine receptor
Type:Cell-surface receptors
Mol. Mass.:50647.10
Organism:Homo sapiens (Human)
Description:P14416
Residue:443
BDBM50312773
NameBDBM50312773
Synonyms:(S)-(4-(1H-indole-6-carbonyl)-3-methylpiperazin-1-yl)(3'-(trifluoromethoxy)biphenyl-4-yl)methanone | CHEMBL1080155
TypeSmall organic molecule
Emp. Form.C28H24F3N3O3
Mol. Mass.507.5037
SMILESC[C@H]1CN(CCN1C(=O)c1ccc2cc[nH]c2c1)C(=O)c1ccc(cc1)-c1cccc(OC(F)(F)F)c1