Reaction Details
TargetD(3) dopamine receptor
LigandBDBM50312775
Substrate/Competitorn/a
Meas. Tech.ChEMBL_615842 (CHEMBL1101952)
Ki>10000±n/a nM
Citation Yu, MLizarzaburu, MBeckmann, HConnors, RDai, KHaller, KLi, CLiang, LLindstrom, MMa, JMotani, AWanska, MZhang, ALi, LMedina, JC Identification of piperazine-bisamide GHSR antagonists for the treatment of obesity. Bioorg Med Chem Lett20:1758-62 (2010) 
 
D(3) dopamine receptor
Name:D(3) dopamine receptor
Type:n/a
Mol. Mass.:44243.43
Organism:Homo sapiens (Human)
Description:n/a
Residue:400
BDBM50312775
NameBDBM50312775
Synonyms:(S)-(4-(1H-indole-6-carbonyl)-3-methylpiperazin-1-yl)(3'-fluorobiphenyl-4-yl)methanone | CHEMBL1082210
TypeSmall organic molecule
Emp. Form.C27H24FN3O2
Mol. Mass.441.4968
SMILESC[C@H]1CN(CCN1C(=O)c1ccc2cc[nH]c2c1)C(=O)c1ccc(cc1)-c1cccc(F)c1