Reaction Details
TargetSodium-dependent dopamine transporter
LigandBDBM50312773
Substrate/Competitorn/a
Meas. Tech.ChEMBL_615843 (CHEMBL1101953)
Ki>10000±n/a nM
Citation Yu, MLizarzaburu, MBeckmann, HConnors, RDai, KHaller, KLi, CLiang, LLindstrom, MMa, JMotani, AWanska, MZhang, ALi, LMedina, JC Identification of piperazine-bisamide GHSR antagonists for the treatment of obesity. Bioorg Med Chem Lett20:1758-62 (2010) 
 
Sodium-dependent dopamine transporter
Name:Sodium-dependent dopamine transporter
Type:Multi-pass membrane protein
Mol. Mass.:68497.11
Organism:Homo sapiens (Human)
Description:Q01959
Residue:620
BDBM50312773
NameBDBM50312773
Synonyms:(S)-(4-(1H-indole-6-carbonyl)-3-methylpiperazin-1-yl)(3'-(trifluoromethoxy)biphenyl-4-yl)methanone | CHEMBL1080155
TypeSmall organic molecule
Emp. Form.C28H24F3N3O3
Mol. Mass.507.5037
SMILESC[C@H]1CN(CCN1C(=O)c1ccc2cc[nH]c2c1)C(=O)c1ccc(cc1)-c1cccc(OC(F)(F)F)c1