Reaction Details
TargetMu-type opioid receptor
LigandBDBM50312779
Substrate/Competitorn/a
Meas. Tech.ChEMBL_615844 (CHEMBL1101954)
Ki>10000±n/a nM
Citation Yu, MLizarzaburu, MBeckmann, HConnors, RDai, KHaller, KLi, CLiang, LLindstrom, MMa, JMotani, AWanska, MZhang, ALi, LMedina, JC Identification of piperazine-bisamide GHSR antagonists for the treatment of obesity. Bioorg Med Chem Lett20:1758-62 (2010) 
 
Mu-type opioid receptor
Name:Mu-type opioid receptor
Type:G Protein-Coupled Receptor (GPCR)
Mol. Mass.:44789.51
Organism:Homo sapiens (Human)
Description:P35372
Residue:400
BDBM50312779
NameBDBM50312779
Synonyms:(S)-(4-(1H-indole-6-carbonyl)-3-methylpiperazin-1-yl)(2'-chlorobiphenyl-4-yl)methanone | CHEMBL1080556
TypeSmall organic molecule
Emp. Form.C27H24ClN3O2
Mol. Mass.457.951
SMILESC[C@H]1CN(CCN1C(=O)c1ccc2cc[nH]c2c1)C(=O)c1ccc(cc1)-c1ccccc1Cl