Reaction Details
TargetMuscarinic acetylcholine receptor M3
LigandBDBM50312779
Substrate/Competitorn/a
Meas. Tech.ChEMBL_615846 (CHEMBL1101956)
Ki>10000±n/a nM
Citation Yu, MLizarzaburu, MBeckmann, HConnors, RDai, KHaller, KLi, CLiang, LLindstrom, MMa, JMotani, AWanska, MZhang, ALi, LMedina, JC Identification of piperazine-bisamide GHSR antagonists for the treatment of obesity. Bioorg Med Chem Lett20:1758-62 (2010) 
 
Muscarinic acetylcholine receptor M3
Name:Muscarinic acetylcholine receptor M3
Type:Enzyme
Mol. Mass.:66151.03
Organism:Homo sapiens (Human)
Description:P20309
Residue:590
BDBM50312779
NameBDBM50312779
Synonyms:(S)-(4-(1H-indole-6-carbonyl)-3-methylpiperazin-1-yl)(2'-chlorobiphenyl-4-yl)methanone | CHEMBL1080556
TypeSmall organic molecule
Emp. Form.C27H24ClN3O2
Mol. Mass.457.951
SMILESC[C@H]1CN(CCN1C(=O)c1ccc2cc[nH]c2c1)C(=O)c1ccc(cc1)-c1ccccc1Cl