Reaction Details
TargetMu-type opioid receptor
LigandBDBM50312859
Substrate/Competitorn/a
Meas. Tech.ChEMBL_615875 (CHEMBL1102709)
Ki 1.5±n/a nM
Citation Ballet, SMarczak, EDFeytens, DSalvadori, SSasaki, YAbell, ADLazarus, LHBalboni, GTourwé, D Novel multiple opioid ligands based on 4-aminobenzazepinone (Aba), azepinoindole (Aia) and tetrahydroisoquinoline (Tic) scaffolds. Bioorg Med Chem Lett20:1610-3 (2010) 
 
Mu-type opioid receptor
Name:Mu-type opioid receptor
Type:G Protein-Coupled Receptor (GPCR)
Mol. Mass.:44503.11
Organism:Rattus norvegicus (rat)
Description:Competition binding assays were carried out using membrane preparations from transfected HN9.10 cells that constitutively expressed the mu opioid receptor.
Residue:398
BDBM50312859
NameBDBM50312859
Synonyms:(S,3S,3'S)-N,N'-(hex-3-ene-1,6-diyl)bis(2-((S)-2-amino-3-(4-hydroxy-2,6-dimethylphenyl)propanoyl)-1,2,3,4-tetrahydroisoquinoline-3-carboxamide) | CHEMBL1076724
TypeSmall organic molecule
Emp. Form.C48H58N6O6
Mol. Mass.815.0107
SMILESCc1cc(O)cc(C)c1C[C@H](N)C(=O)N1Cc2ccccc2C[C@H]1C(=O)NCC\C=C\CCNC(=O)[C@@H]1Cc2ccccc2CN1C(=O)[C@@H](N)Cc1c(C)cc(O)cc1C