Reaction Details
TargetDelta-type opioid receptor
LigandBDBM50312861
Substrate/Competitorn/a
Meas. Tech.ChEMBL_615876 (CHEMBL1102710)
Ki 196±n/a nM
Citation Ballet, SMarczak, EDFeytens, DSalvadori, SSasaki, YAbell, ADLazarus, LHBalboni, GTourwé, D Novel multiple opioid ligands based on 4-aminobenzazepinone (Aba), azepinoindole (Aia) and tetrahydroisoquinoline (Tic) scaffolds. Bioorg Med Chem Lett20:1610-3 (2010) 
 
Delta-type opioid receptor
Name:Delta-type opioid receptor
Type:G Protein-Coupled Receptor (GPCR)
Mol. Mass.:40465.04
Organism:Rattus norvegicus (rat)
Description:Competition binding assays were using CHO-K1 cell membranes expressing the opioid receptor.
Residue:372
BDBM50312861
NameBDBM50312861
Synonyms:(2S,2'S,2''S)-N,N',N''-((4S,4'S,4''S)-2,2',2''-(2,2',2''-(2,2',2''-nitrilotris(ethane-2,1-diyl)tris(azanediyl))tris(2-oxoethane-2,1-diyl))tris(3-oxo-2,3,4,5-tetrahydro-1H-benzo[c]azepine-4,2-diyl))tris(2-amino-3-(4-hydroxy-2,6-dimethylphenyl)propanamide) | CHEMBL1076726
TypeSmall organic molecule
Emp. Form.C75H93N13O12
Mol. Mass.1368.6208
SMILESCc1cc(O)cc(C)c1C[C@H](N)C(=O)N[C@H]1Cc2ccccc2CN(CC(=O)NCCN(CCNC(=O)CN2Cc3ccccc3C[C@H](NC(=O)[C@@H](N)Cc3c(C)cc(O)cc3C)C2=O)CCNC(=O)CN2Cc3ccccc3C[C@H](NC(=O)[C@@H](N)Cc3c(C)cc(O)cc3C)C2=O)C1=O