Reaction Details
TargetMu-type opioid receptor
LigandBDBM50312859
Substrate/Competitorn/a
Meas. Tech.ChEMBL_615882 (CHEMBL1102716)
IC50>10000±n/a nM
Citation Ballet, SMarczak, EDFeytens, DSalvadori, SSasaki, YAbell, ADLazarus, LHBalboni, GTourwé, D Novel multiple opioid ligands based on 4-aminobenzazepinone (Aba), azepinoindole (Aia) and tetrahydroisoquinoline (Tic) scaffolds. Bioorg Med Chem Lett20:1610-3 (2010) 
 
Mu-type opioid receptor
Name:Mu-type opioid receptor
Type:Enzyme Catalytic Domain
Mol. Mass.:11165.58
Organism:GUINEA PIG
Description:P97266
Residue:98
BDBM50312859
NameBDBM50312859
Synonyms:(S,3S,3'S)-N,N'-(hex-3-ene-1,6-diyl)bis(2-((S)-2-amino-3-(4-hydroxy-2,6-dimethylphenyl)propanoyl)-1,2,3,4-tetrahydroisoquinoline-3-carboxamide) | CHEMBL1076724
TypeSmall organic molecule
Emp. Form.C48H58N6O6
Mol. Mass.815.0107
SMILESCc1cc(O)cc(C)c1C[C@H](N)C(=O)N1Cc2ccccc2C[C@H]1C(=O)NCC\C=C\CCNC(=O)[C@@H]1Cc2ccccc2CN1C(=O)[C@@H](N)Cc1c(C)cc(O)cc1C