Reaction Details
TargetProstaglandin D2 receptor 2
LigandBDBM50312907
Substrate/Competitorn/a
Meas. Tech.ChEMBL_615898 (CHEMBL1102912)
IC50 0.072000±n/a nM
Citation Grimstrup, MReceveur, JMRist, ØFrimurer, TMNielsen, PAMathiesen, JMHögberg, T Exploration of SAR features by modifications of thiazoleacetic acids as CRTH2 antagonists. Bioorg Med Chem Lett20:1638-41 (2010) 
 
Prostaglandin D2 receptor 2
Name:Prostaglandin D2 receptor 2
Type:Enzyme
Mol. Mass.:43295.45
Organism:Homo sapiens (Human)
Description:Q9Y5Y4
Residue:395
BDBM50312907
NameBDBM50312907
Synonyms:2-(4-(4-chlorophenyl)-2-(diphenylamino)thiazol-5-yl)acetic acid | CHEMBL1081033
TypeSmall organic molecule
Emp. Form.C23H17ClN2O2S
Mol. Mass.420.911
SMILESOC(=O)Cc1sc(nc1-c1ccc(Cl)cc1)N(c1ccccc1)c1ccccc1