Reaction Details
Target11-beta-hydroxysteroid dehydrogenase 1
LigandBDBM50313286
Substrate/Competitorn/a
Meas. Tech.ChEMBL_617122 (CHEMBL1101380)
IC50 0.33±n/a nM
Citation Shah, UBoyle, CDChackalamannil, SBaker, HKowalski, TLee, JTerracina, GZhang, L Azabicyclic sulfonamides as potent 11beta-HSD1 inhibitors. Bioorg Med Chem Lett20:1551-4 (2010) 
 
11-beta-hydroxysteroid dehydrogenase 1
Name:11-beta-hydroxysteroid dehydrogenase 1
Type:Enzyme
Mol. Mass.:32409.16
Organism:Homo sapiens (Human)
Description:P28845
Residue:292
BDBM50313286
NameBDBM50313286
Synonyms:(1S,4S)-2-methyl-5-(4-neopentylphenylsulfonyl)-2,5-diazabicyclo[2.2.1]heptane | CHEMBL1080752
TypeSmall organic molecule
Emp. Form.C17H26N2O2S
Mol. Mass.322.466
SMILESCN1C[C@@H]2C[C@H]1CN2S(=O)(=O)c1ccc(CC(C)(C)C)cc1