Reaction Details
TargetSphingosine 1-phosphate receptor 1
LigandBDBM50313333
Substrate/Competitorn/a
Meas. Tech.ChEMBL_617125 (CHEMBL1101383)
EC50 960±n/a nM
Citation Crosignani, SBombrun, ACovini, DMaio, MMarin, DQuattropani, ASwinnen, DSimpson, DSauer, WFrançon, BMartin, TCambet, YNichols, AMartinou, IBurgat-Charvillon, FRivron, DDonini, CSchott, OEligert, VNovo-Perez, LVitte, PAArrighi, JF Discovery of a novel series of potent S1P1 agonists. Bioorg Med Chem Lett20:1516-9 (2010) 
 
Sphingosine 1-phosphate receptor 1
Name:Sphingosine 1-phosphate receptor 1
Type:Enzyme
Mol. Mass.:42836.02
Organism:Homo sapiens (Human)
Description:P21453
Residue:382
BDBM50313333
NameBDBM50313333
Synonyms:6-(cyclohexylamino)-N-(4-(methylsulfonamido)phenyl)pyrimidine-4-carboxamide US9150519, 1-13
TypeSmall organic molecule
Emp. Form.C18H23N5O3S
Mol. Mass.389.472
SMILESCS(=O)(=O)Nc1ccc(NC(=O)c2cc(NC3CCCCC3)ncn2)cc1