Reaction Details
TargetSphingosine 1-phosphate receptor 1
LigandBDBM50313355
Substrate/Competitorn/a
Meas. Tech.ChEMBL_617125 (CHEMBL1101383)
EC50 12±n/a nM
Citation Crosignani, SBombrun, ACovini, DMaio, MMarin, DQuattropani, ASwinnen, DSimpson, DSauer, WFrançon, BMartin, TCambet, YNichols, AMartinou, IBurgat-Charvillon, FRivron, DDonini, CSchott, OEligert, VNovo-Perez, LVitte, PAArrighi, JF Discovery of a novel series of potent S1P1 agonists. Bioorg Med Chem Lett20:1516-9 (2010) 
 
Sphingosine 1-phosphate receptor 1
Name:Sphingosine 1-phosphate receptor 1
Type:Enzyme
Mol. Mass.:42836.02
Organism:Homo sapiens (Human)
Description:P21453
Residue:382
BDBM50313355
NameBDBM50313355
Synonyms:2-(4-(6-(cyclohexyl(cyclopropylmethyl)amino)pyrimidine-4-carboxamido)-3-methylphenylsulfonamido)acetic acid US9150519, 1-61
TypeSmall organic molecule
Emp. Form.C24H31N5O5S
Mol. Mass.501.598
SMILESCc1cc(ccc1NC(=O)c1cc(ncn1)N(CC1CC1)C1CCCCC1)S(=O)(=O)NCC(O)=O