Reaction Details
TargetSphingosine 1-phosphate receptor 1
LigandBDBM50313359
Substrate/Competitorn/a
Meas. Tech.ChEMBL_617125 (CHEMBL1101383)
EC50 20±n/a nM
Citation Crosignani, SBombrun, ACovini, DMaio, MMarin, DQuattropani, ASwinnen, DSimpson, DSauer, WFrançon, BMartin, TCambet, YNichols, AMartinou, IBurgat-Charvillon, FRivron, DDonini, CSchott, OEligert, VNovo-Perez, LVitte, PAArrighi, JF Discovery of a novel series of potent S1P1 agonists. Bioorg Med Chem Lett20:1516-9 (2010) 
 
Sphingosine 1-phosphate receptor 1
Name:Sphingosine 1-phosphate receptor 1
Type:Enzyme
Mol. Mass.:42836.02
Organism:Homo sapiens (Human)
Description:P21453
Residue:382
BDBM50313359
NameBDBM50313359
Synonyms:4-(4-(6-(cyclohexyl(cyclopropylmethyl)amino)pyrimidine-4-carboxamido)-3-methylphenylsulfonamido)butanoic acid US9150519, 1-63
TypeSmall organic molecule
Emp. Form.C26H35N5O5S
Mol. Mass.529.652
SMILESCc1cc(ccc1NC(=O)c1cc(ncn1)N(CC1CC1)C1CCCCC1)S(=O)(=O)NCCCC(O)=O