Reaction Details
TargetSphingosine 1-phosphate receptor 3
LigandBDBM50313338
Substrate/Competitorn/a
Meas. Tech.ChEMBL_617126 (CHEMBL1101384)
EC50>30000±n/a nM
Citation Crosignani, SBombrun, ACovini, DMaio, MMarin, DQuattropani, ASwinnen, DSimpson, DSauer, WFrançon, BMartin, TCambet, YNichols, AMartinou, IBurgat-Charvillon, FRivron, DDonini, CSchott, OEligert, VNovo-Perez, LVitte, PAArrighi, JF Discovery of a novel series of potent S1P1 agonists. Bioorg Med Chem Lett20:1516-9 (2010) 
 
Sphingosine 1-phosphate receptor 3
Name:Sphingosine 1-phosphate receptor 3
Type:G Protein-Coupled Receptor (GPCR)
Mol. Mass.:42278.13
Organism:Homo sapiens (Human)
Description:Q99500
Residue:378
BDBM50313338
NameBDBM50313338
Synonyms:6-(cyclohexyl(cyclopropylmethyl)amino)-N-(2-methyl-4-sulfamoylphenyl)pyrimidine-4-carboxamide US9150519, 1-38
TypeSmall organic molecule
Emp. Form.C22H29N5O3S
Mol. Mass.443.562
SMILESCc1cc(ccc1NC(=O)c1cc(ncn1)N(CC1CC1)C1CCCCC1)S(N)(=O)=O