Reaction Details
TargetSphingosine 1-phosphate receptor 5
LigandBDBM50313311
Substrate/Competitorn/a
Meas. Tech.ChEMBL_617127 (CHEMBL1101385)
EC50 142±n/a nM
Citation Crosignani, SBombrun, ACovini, DMaio, MMarin, DQuattropani, ASwinnen, DSimpson, DSauer, WFrançon, BMartin, TCambet, YNichols, AMartinou, IBurgat-Charvillon, FRivron, DDonini, CSchott, OEligert, VNovo-Perez, LVitte, PAArrighi, JF Discovery of a novel series of potent S1P1 agonists. Bioorg Med Chem Lett20:1516-9 (2010) 
 
Sphingosine 1-phosphate receptor 5
Name:Sphingosine 1-phosphate receptor 5
Type:G Protein-Coupled Receptor (GPCR)
Mol. Mass.:41796.42
Organism:Homo sapiens (Human)
Description:n/a
Residue:398
BDBM50313311
NameBDBM50313311
Synonyms:6-((cyclopropylmethyl)(propyl)amino)-N-(1H-indazol-5-yl)pyrimidine-4-carboxamide US9150519, 1-45
TypeSmall organic molecule
Emp. Form.C19H22N6O
Mol. Mass.350.4176
SMILESCCCN(CC1CC1)c1cc(ncn1)C(=O)Nc1ccc2[nH]ncc2c1