Reaction Details
TargetSphingosine 1-phosphate receptor 5
LigandBDBM50313357
Substrate/Competitorn/a
Meas. Tech.ChEMBL_617127 (CHEMBL1101385)
EC50 114±n/a nM
Citation Crosignani, SBombrun, ACovini, DMaio, MMarin, DQuattropani, ASwinnen, DSimpson, DSauer, WFrançon, BMartin, TCambet, YNichols, AMartinou, IBurgat-Charvillon, FRivron, DDonini, CSchott, OEligert, VNovo-Perez, LVitte, PAArrighi, JF Discovery of a novel series of potent S1P1 agonists. Bioorg Med Chem Lett20:1516-9 (2010) 
 
Sphingosine 1-phosphate receptor 5
Name:Sphingosine 1-phosphate receptor 5
Type:G Protein-Coupled Receptor (GPCR)
Mol. Mass.:41796.42
Organism:Homo sapiens (Human)
Description:n/a
Residue:398
BDBM50313357
NameBDBM50313357
Synonyms:3-(4-(6-(cyclohexyl(cyclopropylmethyl)amino)pyrimidine-4-carboxamido)-3-methylphenylsulfonamido)propanoic acid US9150519, 1-62
TypeSmall organic molecule
Emp. Form.C25H33N5O5S
Mol. Mass.515.625
SMILESCc1cc(ccc1NC(=O)c1cc(ncn1)N(CC1CC1)C1CCCCC1)S(=O)(=O)NCCC(O)=O