Reaction Details
TargetSodium/glucose cotransporter 1
LigandBDBM50308469
Substrate/Competitorn/a
Meas. Tech.ChEMBL_617326 (CHEMBL1100948)
IC50 240±n/a nM
Citation Robinson, RPMascitti, VBoustany-Kari, CMCarr, CLFoley, PMKimoto, ELeininger, MTLowe, AKlenotic, MKMacdonald, JIMaguire, RJMasterson, VMMaurer, TSMiao, ZPatel, JDPréville, CReese, MRShe, LSteppan, CMThuma, BAZhu, T C-Aryl glycoside inhibitors of SGLT2: Exploration of sugar modifications including C-5 spirocyclization. Bioorg Med Chem Lett20:1569-72 (2010) 
 
Sodium/glucose cotransporter 1
Name:Sodium/glucose cotransporter 1
Type:Protein
Mol. Mass.:73503.78
Organism:Homo sapiens (Human)
Description:P13866
Residue:664
BDBM50308469
NameBDBM50308469
Synonyms:(2S,3R,4R,5S,6R)-2-(4-chloro-3-(4-methoxybenzyl)phenyl)-6-(hydroxymethyl)tetrahydro-2H-pyran-3,4,5-triol CHEMBL3125315 CHEMBL589305
TypeSmall organic molecule
Emp. Form.C20H23ClO6
Mol. Mass.394.846
SMILESCOc1ccc(Cc2cc(ccc2Cl)[C@@H]2O[C@H](CO)[C@@H](O)[C@H](O)[C@H]2O)cc1