Reaction Details
TargetSodium/glucose cotransporter 1
LigandBDBM50313371
Substrate/Competitorn/a
Meas. Tech.ChEMBL_617326 (CHEMBL1100948)
IC50 73±n/a nM
Citation Robinson, RPMascitti, VBoustany-Kari, CMCarr, CLFoley, PMKimoto, ELeininger, MTLowe, AKlenotic, MKMacdonald, JIMaguire, RJMasterson, VMMaurer, TSMiao, ZPatel, JDPréville, CReese, MRShe, LSteppan, CMThuma, BAZhu, T C-Aryl glycoside inhibitors of SGLT2: Exploration of sugar modifications including C-5 spirocyclization. Bioorg Med Chem Lett20:1569-72 (2010) 
 
Sodium/glucose cotransporter 1
Name:Sodium/glucose cotransporter 1
Type:Protein
Mol. Mass.:73503.78
Organism:Homo sapiens (Human)
Description:P13866
Residue:664
BDBM50313371
NameBDBM50313371
Synonyms:(2S,3R,4S,5S,6R)-2-(4-chloro-3-(4-methoxybenzyl)phenyl)-6-methyltetrahydro-2H-pyran-3,4,5-triol | CHEMBL1085691
TypeSmall organic molecule
Emp. Form.C20H23ClO5
Mol. Mass.378.847
SMILESCOc1ccc(Cc2cc(ccc2Cl)[C@@H]2O[C@H](C)[C@@H](O)[C@H](O)[C@H]2O)cc1