Reaction Details
TargetSodium/glucose cotransporter 1
LigandBDBM50313374
Substrate/Competitorn/a
Meas. Tech.ChEMBL_617326 (CHEMBL1100948)
IC50 190±n/a nM
Citation Robinson, RPMascitti, VBoustany-Kari, CMCarr, CLFoley, PMKimoto, ELeininger, MTLowe, AKlenotic, MKMacdonald, JIMaguire, RJMasterson, VMMaurer, TSMiao, ZPatel, JDPréville, CReese, MRShe, LSteppan, CMThuma, BAZhu, T C-Aryl glycoside inhibitors of SGLT2: Exploration of sugar modifications including C-5 spirocyclization. Bioorg Med Chem Lett20:1569-72 (2010) 
 
Sodium/glucose cotransporter 1
Name:Sodium/glucose cotransporter 1
Type:Protein
Mol. Mass.:73503.78
Organism:Homo sapiens (Human)
Description:P13866
Residue:664
BDBM50313374
NameBDBM50313374
Synonyms:(5S,6R,7R,8S)-5-(3-(4-ethylbenzyl)-4-methylphenyl)-4-oxaspiro[2.5]octane-6,7,8-triol | CHEMBL1098376
TypeSmall organic molecule
Emp. Form.C23H28O4
Mol. Mass.368.466
SMILESCCc1ccc(Cc2cc(ccc2C)[C@@H]2OC3(CC3)[C@@H](O)[C@H](O)[C@H]2O)cc1