Reaction Details
TargetNeuropilin-1
LigandBDBM50313490
Substrate/Competitorn/a
Meas. Tech.ChEMBL_617636 (CHEMBL1101245)
IC50 33000±n/a nM
Citation Jarvis, AAllerston, CKJia, HHerzog, BGarza-Garcia, AWinfield, NEllard, KAqil, RLynch, RChapman, CHartzoulakis, BNally, JStewart, MCheng, LMenon, MTickner, MDjordjevic, SDriscoll, PCZachary, ISelwood, DL Small molecule inhibitors of the neuropilin-1 vascular endothelial growth factor A (VEGF-A) interaction. J Med Chem53:2215-26 (2010) 
 
Neuropilin-1
Name:Neuropilin-1
Type:PROTEIN
Mol. Mass.:103122.09
Organism:Homo sapiens (Human)
Description:ChEMBL_617636
Residue:923
BDBM50313490
NameBDBM50313490
Synonyms:(S)-2-{[3-(2,4-Difluoro-benzenesulfonylamino)-thiophene-2-carbonyl]-amino}-5-guanidino-pentanoic acid | CHEMBL1078973
TypeSmall organic molecule
Emp. Form.C17H19F2N5O5S2
Mol. Mass.475.49
SMILES[#7]\[#6](-[#7])=[#7]\[#6]-[#6]-[#6]-[#6@H](-[#7]-[#6](=O)-c1sccc1-[#7]S(=O)(=O)c1ccc(F)cc1F)-[#6](-[#8])=O