Reaction Details
TargetGlycogen synthase kinase-3 beta
LigandBDBM50313703
Substrate/Competitorn/a
Meas. Tech.ChEMBL_614756 (CHEMBL1113275)
IC50 27±n/a nM
Citation Lesuisse, DDutruc-Rosset, GTiraboschi, GDreyer, MKMaignan, SChevalier, AHalley, FBertrand, PBurgevin, MCQuarteronet, DRooney, T Rational design of potent GSK3beta inhibitors with selectivity for Cdk1 and Cdk2. Bioorg Med Chem Lett20:1985-9 (2010) 
 
Glycogen synthase kinase-3 beta
Name:Glycogen synthase kinase-3 beta
Type:Enzyme
Mol. Mass.:46756.38
Organism:Homo sapiens (Human)
Description:P49841
Residue:420
BDBM50313703
NameBDBM50313703
Synonyms:CHEMBL1082236 | N-(6-(3,4-dihydroxyphenyl)-1H-indazol-3-yl)butyramide
TypeSmall organic molecule
Emp. Form.C17H17N3O3
Mol. Mass.311.3352
SMILESCCCC(=O)Nc1n[nH]c2cc(ccc12)-c1ccc(O)c(O)c1