Reaction Details
TargetGlycogen synthase kinase-3 beta
LigandBDBM50313704
Substrate/Competitorn/a
Meas. Tech.ChEMBL_614756 (CHEMBL1113275)
IC50 55±n/a nM
Citation Lesuisse, DDutruc-Rosset, GTiraboschi, GDreyer, MKMaignan, SChevalier, AHalley, FBertrand, PBurgevin, MCQuarteronet, DRooney, T Rational design of potent GSK3beta inhibitors with selectivity for Cdk1 and Cdk2. Bioorg Med Chem Lett20:1985-9 (2010) 
 
Glycogen synthase kinase-3 beta
Name:Glycogen synthase kinase-3 beta
Type:Enzyme
Mol. Mass.:46756.38
Organism:Homo sapiens (Human)
Description:P49841
Residue:420
BDBM50313704
NameBDBM50313704
Synonyms:CHEMBL1088618 | N-(6-(2-chloro-4-hydroxyphenyl)-1H-indazol-3-yl)butyramide
TypeSmall organic molecule
Emp. Form.C17H16ClN3O2
Mol. Mass.329.781
SMILESCCCC(=O)Nc1n[nH]c2cc(ccc12)-c1ccc(O)cc1Cl