Reaction Details
TargetOxytocin receptor
LigandBDBM50313815
Substrate/Competitorn/a
Meas. Tech.ChEMBL_615224 (CHEMBL1115874)
Ki 43±n/a nM
Citation Brown, AEllis, DWallace, ORalph, M Identification of a urea bioisostere of a triazole oxytocin antagonist. Bioorg Med Chem Lett20:1851-3 (2010) 
 
Oxytocin receptor
Name:Oxytocin receptor
Type:Enzyme Catalytic Domain
Mol. Mass.:42793.26
Organism:Homo sapiens (Human)
Description:Oxytocin OXTR HEK293::B2R9L7
Residue:389
BDBM50313815
NameBDBM50313815
Synonyms:CHEMBL1094050 | N-ethyl-3-(4-fluoro-2-methylphenoxy)-N-(6-methoxypyridin-3-yl)azetidine-1-carboxamide
TypeSmall organic molecule
Emp. Form.C19H22FN3O3
Mol. Mass.359.3947
SMILESCCN(C(=O)N1CC(C1)Oc1ccc(F)cc1C)c1ccc(OC)nc1