Reaction Details
TargetDisintegrin and metalloproteinase domain-containing protein 17
LigandBDBM50313838
Substrate/Competitorn/a
Meas. Tech.ChEMBL_615262 (CHEMBL1115912)
Ki 1.6±n/a nM
Citation Yu, WGuo, ZOrth, PMadison, VChen, LDai, CFeltz, RJGirijavallabhan, VMKim, SHKozlowski, JALavey, BJLi, DLundell, DNiu, XPiwinski, JJPopovici-Muller, JRizvi, RRosner, KEShankar, BBShih, NYSiddiqui, MASun, JTong, LUmland, SWong, MKYang, DYZhou, G Discovery and SAR of hydantoin TACE inhibitors. Bioorg Med Chem Lett20:1877-80 (2010) 
 
Disintegrin and metalloproteinase domain-containing protein 17
Name:Disintegrin and metalloproteinase domain-containing protein 17
Type:Enzyme
Mol. Mass.:93007.89
Organism:Homo sapiens (Human)
Description:
Residue:824
BDBM50313838
NameBDBM50313838
Synonyms:(R)-5-(4-hydroxyphenyl)-5-((6-methoxy-1-oxoisoindolin-2-yl)methyl)imidazolidine-2,4-dione | CHEMBL1090736
TypeSmall organic molecule
Emp. Form.C19H17N3O5
Mol. Mass.367.3554
SMILESCOc1ccc2CN(C[C@]3(NC(=O)NC3=O)c3ccc(O)cc3)C(=O)c2c1