Reaction Details
TargetDisintegrin and metalloproteinase domain-containing protein 17
LigandBDBM50313839
Substrate/Competitorn/a
Meas. Tech.ChEMBL_615262 (CHEMBL1115912)
Ki 0.400000±n/a nM
Citation Yu, WGuo, ZOrth, PMadison, VChen, LDai, CFeltz, RJGirijavallabhan, VMKim, SHKozlowski, JALavey, BJLi, DLundell, DNiu, XPiwinski, JJPopovici-Muller, JRizvi, RRosner, KEShankar, BBShih, NYSiddiqui, MASun, JTong, LUmland, SWong, MKYang, DYZhou, G Discovery and SAR of hydantoin TACE inhibitors. Bioorg Med Chem Lett20:1877-80 (2010) 
 
Disintegrin and metalloproteinase domain-containing protein 17
Name:Disintegrin and metalloproteinase domain-containing protein 17
Type:Enzyme
Mol. Mass.:93007.89
Organism:Homo sapiens (Human)
Description:
Residue:824
BDBM50313839
NameBDBM50313839
Synonyms:(R)-5-((6-chloro-1-oxoisoindolin-2-yl)methyl)-5-(4-fluorophenyl)imidazolidine-2,4-dione | CHEMBL1077203
TypeSmall organic molecule
Emp. Form.C18H13ClFN3O3
Mol. Mass.373.766
SMILESFc1ccc(cc1)[C@]1(CN2Cc3ccc(Cl)cc3C2=O)NC(=O)NC1=O