Reaction Details
TargetDisintegrin and metalloproteinase domain-containing protein 17
LigandBDBM50313842
Substrate/Competitorn/a
Meas. Tech.ChEMBL_615262 (CHEMBL1115912)
Ki 0.700000±n/a nM
Citation Yu, WGuo, ZOrth, PMadison, VChen, LDai, CFeltz, RJGirijavallabhan, VMKim, SHKozlowski, JALavey, BJLi, DLundell, DNiu, XPiwinski, JJPopovici-Muller, JRizvi, RRosner, KEShankar, BBShih, NYSiddiqui, MASun, JTong, LUmland, SWong, MKYang, DYZhou, G Discovery and SAR of hydantoin TACE inhibitors. Bioorg Med Chem Lett20:1877-80 (2010) 
 
Disintegrin and metalloproteinase domain-containing protein 17
Name:Disintegrin and metalloproteinase domain-containing protein 17
Type:Enzyme
Mol. Mass.:93007.89
Organism:Homo sapiens (Human)
Description:
Residue:824
BDBM50313842
NameBDBM50313842
Synonyms:(R)-5-((6-methoxy-1-oxoisoindolin-2-yl)methyl)-5-(pyrazin-2-yl)imidazolidine-2,4-dione | CHEMBL1077216
TypeSmall organic molecule
Emp. Form.C17H15N5O4
Mol. Mass.353.3321
SMILESCOc1ccc2CN(C[C@]3(NC(=O)NC3=O)c3cnccn3)C(=O)c2c1