Reaction Details
TargetD(3) dopamine receptor
LigandBDBM50313913
Substrate/Competitorn/a
Meas. Tech.ChEMBL_615496 (CHEMBL1105126)
Ki>10000±n/a nM
Citation Robaa, DEnzensperger, CAbul Azm, Sel DEl Khawass, el SEl Sayed, OLehmann, J Dopamine receptor ligands. Part 18: (1) modification of the structural skeleton of indolobenzazecine-type dopamine receptor antagonists. J Med Chem53:2646-50 (2010) 
 
D(3) dopamine receptor
Name:D(3) dopamine receptor
Type:n/a
Mol. Mass.:44243.43
Organism:Homo sapiens (Human)
Description:n/a
Residue:400
BDBM50313913
NameBDBM50313913
Synonyms:5,6,8,9,10,14c-Hexahydroindolo[3',2':3,4,]pyrido[2,1-a]isoquinoline | CHEMBL1086789
TypeSmall organic molecule
Emp. Form.C19H18N2
Mol. Mass.274.3596
SMILESC1Cc2[nH]c3ccccc3c2C2N1CCc1ccccc21