Reaction Details
TargetD(1A) dopamine receptor
LigandBDBM50313914
Substrate/Competitorn/a
Meas. Tech.ChEMBL_615494 (CHEMBL1105124)
Ki 1836±n/a nM
Citation Robaa, DEnzensperger, CAbul Azm, Sel DEl Khawass, el SEl Sayed, OLehmann, J Dopamine receptor ligands. Part 18: (1) modification of the structural skeleton of indolobenzazecine-type dopamine receptor antagonists. J Med Chem53:2646-50 (2010) 
 
D(1A) dopamine receptor
Name:D(1A) dopamine receptor
Type:Enzyme
Mol. Mass.:49303.43
Organism:Homo sapiens (Human)
Description:P21728
Residue:446
BDBM50313914
NameBDBM50313914
Synonyms:2,6,7,9,10,14b-Hexahydroindolo[3',4':3,4,5]azepino[2,1-a]-isoquinoline | CHEMBL1086790
TypeSmall organic molecule
Emp. Form.C19H18N2
Mol. Mass.274.3596
SMILESC1Cc2ccccc2C2N1CCc1cccc3[nH]cc2c13