Reaction Details
TargetD(3) dopamine receptor
LigandBDBM50313918
Substrate/Competitorn/a
Meas. Tech.ChEMBL_615496 (CHEMBL1105126)
Ki>10000±n/a nM
Citation Robaa, DEnzensperger, CAbul Azm, Sel DEl Khawass, el SEl Sayed, OLehmann, J Dopamine receptor ligands. Part 18: (1) modification of the structural skeleton of indolobenzazecine-type dopamine receptor antagonists. J Med Chem53:2646-50 (2010) 
 
D(3) dopamine receptor
Name:D(3) dopamine receptor
Type:n/a
Mol. Mass.:44243.43
Organism:Homo sapiens (Human)
Description:n/a
Residue:400
BDBM50313918
NameBDBM50313918
Synonyms:5-Methyl-4,5,6,7-tetrahydroindolo[4,3a,3-ef][3]benzazecine | CHEMBL1088073
TypeSmall organic molecule
Emp. Form.C19H20N2
Mol. Mass.276.3755
SMILESCN1CCc2ccccc2Cc2c[nH]c3cccc(C1)c23