Reaction Details
TargetCorticotropin-releasing factor receptor 1
LigandBDBM50314008
Substrate/Competitorn/a
Meas. Tech.ChEMBL_615933 (CHEMBL1099779)
Ki 8±n/a nM
Citation Vrudhula, VMDasgupta, BPin, SSBurris, KDBalanda, LAFung, LKFiedler, TBrowman, KETaber, MTZhang, JMacor, JEDubowchik, GM Design, synthesis and evaluation of constrained tetrahydroimidazopyrimidine derivatives as antagonists of corticotropin-releasing factor type 1 receptor (CRF1R). Bioorg Med Chem Lett20:1905-9 (2010) 
 
Corticotropin-releasing factor receptor 1
Name:Corticotropin-releasing factor receptor 1
Type:Enzyme
Mol. Mass.:50744.31
Organism:Homo sapiens (Human)
Description:P34998
Residue:444
BDBM50314008
NameBDBM50314008
Synonyms:CHEMBL1087165 | N-(cyclopropylmethyl)-2,2,2-trifluoro-N-((8-mesityl-2-(trifluoromethyl)-5,6,7,8-tetrahydroimidazo[1,2-a]pyrimidin-3-yl)methyl)ethanamine
TypeSmall organic molecule
Emp. Form.C23H28F6N4
Mol. Mass.474.4856
SMILESCc1cc(C)c(N2CCCn3c(CN(CC4CC4)CC(F)(F)F)c(nc23)C(F)(F)F)c(C)c1