Reaction Details
TargetCannabinoid receptor 1
LigandBDBM50314110
Substrate/Competitorn/a
Meas. Tech.ChEMBL_627675 (CHEMBL1115255)
IC50 17±n/a nM
Citation Debenham, JSMadsen-Duggan, CBToupence, RBWalsh, TFWang, JTong, XKumar, SLao, JFong, TMXiao, JCHuang, CRShen, CPFeng, YMarsh, DJStribling, DSShearman, LPStrack, AMGoulet, MT Furo[2,3-b]pyridine-based cannabinoid-1 receptor inverse agonists: synthesis and biological evaluation. Part 1. Bioorg Med Chem Lett20:1448-52 (2010) 
 
Cannabinoid receptor 1
Name:Cannabinoid receptor 1
Type:G Protein-Coupled Receptor (GPCR)
Mol. Mass.:52868.96
Organism:Homo sapiens (Human)
Description:P21554
Residue:472
BDBM50314110
NameBDBM50314110
Synonyms:1-(3-amino-5-(4-chlorophenyl)-6-(2,4-dichlorophenyl)furo[2,3-b]pyridin-2-yl)propan-1-one | CHEMBL1093997
TypeSmall organic molecule
Emp. Form.C22H15Cl3N2O2
Mol. Mass.445.726
SMILESCCC(=O)c1oc2nc(-c3ccc(Cl)cc3Cl)c(cc2c1N)-c1ccc(Cl)cc1