Reaction Details
TargetCannabinoid receptor 1
LigandBDBM50314111
Substrate/Competitorn/a
Meas. Tech.ChEMBL_627675 (CHEMBL1115255)
IC50 13±n/a nM
Citation Debenham, JSMadsen-Duggan, CBToupence, RBWalsh, TFWang, JTong, XKumar, SLao, JFong, TMXiao, JCHuang, CRShen, CPFeng, YMarsh, DJStribling, DSShearman, LPStrack, AMGoulet, MT Furo[2,3-b]pyridine-based cannabinoid-1 receptor inverse agonists: synthesis and biological evaluation. Part 1. Bioorg Med Chem Lett20:1448-52 (2010) 
 
Cannabinoid receptor 1
Name:Cannabinoid receptor 1
Type:G Protein-Coupled Receptor (GPCR)
Mol. Mass.:52868.96
Organism:Homo sapiens (Human)
Description:P21554
Residue:472
BDBM50314111
NameBDBM50314111
Synonyms:1-(3-amino-6-(2-chlorophenyl)-5-(4-chlorophenyl)furo[2,3-b]pyridin-2-yl)propan-1-one | CHEMBL1089337
TypeSmall organic molecule
Emp. Form.C22H16Cl2N2O2
Mol. Mass.411.281
SMILESCCC(=O)c1oc2nc(-c3ccccc3Cl)c(cc2c1N)-c1ccc(Cl)cc1